{"text_format":"1","workbook":"xlsx","n_sheets":10,"sheets":["Qualifying Round 1","Qualifying Round 2","Qualifying Round 3","Points","Q1 Results","Q2 Results","Q1-4 Results","Q1 Times","Q2 Times","Q1-3 Times"],"not_rendered":{"charts":0,"images":1,"macros":1,"external_links":0,"defined_names":5,"comments":0,"pivot_tables":0},"unopened":[],"bounds":{"document_bytes":16777216,"sheet_cells":100000,"rows_first":2000,"rows_last":500,"rows_between":2000,"halvings":0,"cell_chars":16384,"cell_head_chars":4096},"cells_cut":0,"cells_raw":0,"read":"whole","date_system":"1900"}

{"sheet":"Qualifying Round 1","index":0,"n_rows":9,"n_cols":4,"rows_kept":9,"cut":false,"hidden":false,"merged":[[0,0,0,3],[1,0,1,3],[5,0,5,1],[5,2,5,3]]}
["Funny Car"]
["Qualifying Round 1 Pairings"]
[]
["Version:","1","Published:",{"$f":"NOW()","v":"2022-04-15T15:14:33.130"}]
[]
["Left",null,"Right"]
["123","Jason Phelps",null,"Bye"]
[null,"Bye",392,{"$f":"IFERROR(VLOOKUP(C8,public_rn_racers[[Race '#]:[Name]],2,FALSE),\"\")","v":"Kevin Kent"}]
[4250,{"$f":"IFERROR(VLOOKUP(A9,public_rn_racers[[Race '#]:[Name]],2,FALSE),\"\")","v":"Steve Ashdown"},1020,{"$f":"IFERROR(VLOOKUP(C9,public_rn_racers[[Race '#]:[Name]],2,FALSE),\"\")","v":"Kevin Chapman"}]

{"sheet":"Qualifying Round 2","index":1,"n_rows":10,"n_cols":4,"rows_kept":10,"cut":false,"hidden":false,"merged":[[0,0,0,3],[1,0,1,3],[5,0,5,1],[5,2,5,3]]}
["Funny Car"]
["Qualifying Round 2 Pairings"]
[]
["Version:","2","Published:",{"$f":"NOW()","v":"2022-04-15T15:14:33.130"}]
[]
["Left",null,"Right"]
["Race #","Name","Race #","Name"]
[392,{"$f":"IFERROR(VLOOKUP(A8,public_rn_racers[[Race '#]:[Name]],2,FALSE),\"\")","v":"Kevin Kent"},null,"Bye"]
[null,{"$f":"IFERROR(VLOOKUP(A9,public_rn_racers[[Race '#]:[Name]],2,FALSE),\"\")","v":""},123,{"$f":"IFERROR(VLOOKUP(C9,public_rn_racers[[Race '#]:[Name]],2,FALSE),\"\")","v":"Jason Phelps"}]
[1020,{"$f":"IFERROR(VLOOKUP(A10,public_rn_racers[[Race '#]:[Name]],2,FALSE),\"\")","v":"Kevin Chapman"},4250,{"$f":"IFERROR(VLOOKUP(C10,public_rn_racers[[Race '#]:[Name]],2,FALSE),\"\")","v":"Steve Ashdown"}]

{"sheet":"Qualifying Round 3","index":2,"n_rows":10,"n_cols":4,"rows_kept":10,"cut":false,"hidden":false,"merged":[[0,0,0,3],[1,0,1,3],[5,0,5,1],[5,2,5,3]]}
["Motorsport UK Pro Modified"]
["Qualifying Round 4 Pairings"]
[]
["Version:","1","Published:",{"$f":"NOW()","v":"2022-04-15T15:14:33.130"}]
[]
["Left",null,"Right"]
["Race #","Name","Race #","Name"]
[{"$f":"#REF!","v":{"$error":"#REF!"}},{"$f":"IFERROR(VLOOKUP(A8,public_rn_racers[[Race '#]:[Name]],2,FALSE),\"\")","v":""},{"$f":"#REF!","v":{"$error":"#REF!"}},{"$f":"IFERROR(VLOOKUP(C8,public_rn_racers[[Race '#]:[Name]],2,FALSE),\"\")","v":""}]
[{"$f":"#REF!","v":{"$error":"#REF!"}},{"$f":"IFERROR(VLOOKUP(A9,public_rn_racers[[Race '#]:[Name]],2,FALSE),\"\")","v":""},{"$f":"#REF!","v":{"$error":"#REF!"}},{"$f":"IFERROR(VLOOKUP(C9,public_rn_racers[[Race '#]:[Name]],2,FALSE),\"\")","v":""}]
[{"$f":"#REF!","v":{"$error":"#REF!"}},{"$f":"IFERROR(VLOOKUP(A10,public_rn_racers[[Race '#]:[Name]],2,FALSE),\"\")","v":""},{"$f":"#REF!","v":{"$error":"#REF!"}},{"$f":"IFERROR(VLOOKUP(C10,public_rn_racers[[Race '#]:[Name]],2,FALSE),\"\")","v":""}]

{"sheet":"Points","index":3,"n_rows":12,"n_cols":4,"rows_kept":12,"cut":false,"hidden":false,"merged":[]}
["Pos","Points","Race #","Name"]
[1,0,123,"Jason Phelps"]
[2,0,392,"Kevin Kent"]
[3,0,1020,"Kevin Chapman"]
[4,0,4250,"Steve Ashdown"]
[5,0,"1953","JOHN TEBENHAM"]
[6,0,"12","JEAN DULAMON"]
[7,0,"101","ANDY ROBINSON"]
[8,105,"507","JON WEBSTER"]
[9,157,"777","WAYNE NICHOLSON"]
[10,245,"2","KEVIN SLYFIELD"]
[11,253,"570","NICK DAVIES"]

{"sheet":"Q1 Results","index":4,"n_rows":10,"n_cols":6,"rows_kept":10,"cut":false,"hidden":false,"merged":[[2,0,2,1],[2,3,2,4],[0,0,0,5]]}
["Qualifying Round 1 Times"]
[]
["Left",null,null,"Right"]
["Race #","Name","Time","Race #","Name","Time"]
[{"$f":"#REF!","v":{"$error":"#REF!"}},{"$f":"IFERROR(VLOOKUP(A5,public_rn_racers[[Race '#]:[Name]],2,FALSE),\"\")","v":""},{"$f":"IFERROR(VLOOKUP(A5,Q1_Times[],2,FALSE),99)","v":99},{"$f":"#REF!","v":{"$error":"#REF!"}},{"$f":"IFERROR(VLOOKUP(D5,public_rn_racers[[Race '#]:[Name]],2,FALSE),\"\")","v":""},{"$f":"IFERROR(VLOOKUP(D5,Q1_Times[],2,FALSE),99)","v":99}]
[{"$f":"#REF!","v":{"$error":"#REF!"}},{"$f":"IFERROR(VLOOKUP(A6,public_rn_racers[[Race '#]:[Name]],2,FALSE),\"\")","v":""},{"$f":"IFERROR(VLOOKUP(A6,Q1_Times[],2,FALSE),99)","v":99},{"$f":"#REF!","v":{"$error":"#REF!"}},{"$f":"IFERROR(VLOOKUP(D6,public_rn_racers[[Race '#]:[Name]],2,FALSE),\"\")","v":""},{"$f":"IFERROR(VLOOKUP(D6,Q1_Times[],2,FALSE),99)","v":99}]
[{"$f":"#REF!","v":{"$error":"#REF!"}},{"$f":"IFERROR(VLOOKUP(A7,public_rn_racers[[Race '#]:[Name]],2,FALSE),\"\")","v":""},{"$f":"IFERROR(VLOOKUP(A7,Q1_Times[],2,FALSE),99)","v":99},{"$f":"#REF!","v":{"$error":"#REF!"}},{"$f":"IFERROR(VLOOKUP(D7,public_rn_racers[[Race '#]:[Name]],2,FALSE),\"\")","v":""},{"$f":"IFERROR(VLOOKUP(D7,Q1_Times[],2,FALSE),99)","v":99}]
[{"$f":"#REF!","v":{"$error":"#REF!"}},{"$f":"IFERROR(VLOOKUP(A8,public_rn_racers[[Race '#]:[Name]],2,FALSE),\"\")","v":""},{"$f":"IFERROR(VLOOKUP(A8,Q1_Times[],2,FALSE),99)","v":99},{"$f":"#REF!","v":{"$error":"#REF!"}},{"$f":"IFERROR(VLOOKUP(D8,public_rn_racers[[Race '#]:[Name]],2,FALSE),\"\")","v":""},{"$f":"IFERROR(VLOOKUP(D8,Q1_Times[],2,FALSE),99)","v":99}]
[{"$f":"#REF!","v":{"$error":"#REF!"}},{"$f":"IFERROR(VLOOKUP(A9,public_rn_racers[[Race '#]:[Name]],2,FALSE),\"\")","v":""},{"$f":"IFERROR(VLOOKUP(A9,Q1_Times[],2,FALSE),99)","v":99},{"$f":"#REF!","v":{"$error":"#REF!"}},{"$f":"IFERROR(VLOOKUP(D9,public_rn_racers[[Race '#]:[Name]],2,FALSE),\"\")","v":""},{"$f":"IFERROR(VLOOKUP(D9,Q1_Times[],2,FALSE),99)","v":99}]
[{"$f":"#REF!","v":{"$error":"#REF!"}},{"$f":"IFERROR(VLOOKUP(A10,public_rn_racers[[Race '#]:[Name]],2,FALSE),\"\")","v":""},{"$f":"IFERROR(VLOOKUP(A10,Q1_Times[],2,FALSE),99)","v":99},{"$f":"#REF!","v":{"$error":"#REF!"}},{"$f":"IFERROR(VLOOKUP(D10,public_rn_racers[[Race '#]:[Name]],2,FALSE),\"\")","v":""},{"$f":"IFERROR(VLOOKUP(D10,Q1_Times[],2,FALSE),99)","v":99}]

{"sheet":"Q2 Results","index":5,"n_rows":10,"n_cols":6,"rows_kept":10,"cut":false,"hidden":false,"merged":[[0,0,0,5],[2,0,2,1],[2,3,2,4]]}
["Qualifying Round 2 Times"]
[]
["Left",null,null,"Right"]
["Race #","Name","Time","Race #","Name","Time"]
[{"$f":"'Qualifying Round 1'!#REF!","v":{"$error":"#REF!"}},{"$f":"IFERROR(VLOOKUP(A5,public_rn_racers[[Race '#]:[Name]],2,FALSE),\"\")","v":""},{"$f":"IFERROR(VLOOKUP(A5,Q2_Times[],2,FALSE),99)","v":99},{"$f":"'Qualifying Round 1'!C8","v":392},{"$f":"IFERROR(VLOOKUP(D5,public_rn_racers[[Race '#]:[Name]],2,FALSE),\"\")","v":"Kevin Kent"},{"$f":"IFERROR(VLOOKUP(D5,Q2_Times[],2,FALSE),99)","v":99}]
[{"$f":"'Qualifying Round 1'!A8","v":0},{"$f":"IFERROR(VLOOKUP(A6,public_rn_racers[[Race '#]:[Name]],2,FALSE),\"\")","v":""},{"$f":"IFERROR(VLOOKUP(A6,Q2_Times[],2,FALSE),99)","v":99},{"$f":"'Qualifying Round 1'!C9","v":1020},{"$f":"IFERROR(VLOOKUP(D6,public_rn_racers[[Race '#]:[Name]],2,FALSE),\"\")","v":"Kevin Chapman"},{"$f":"IFERROR(VLOOKUP(D6,Q2_Times[],2,FALSE),99)","v":99}]
[{"$f":"'Qualifying Round 1'!#REF!","v":{"$error":"#REF!"}},{"$f":"IFERROR(VLOOKUP(A7,public_rn_racers[[Race '#]:[Name]],2,FALSE),\"\")","v":""},{"$f":"IFERROR(VLOOKUP(A7,Q2_Times[],2,FALSE),99)","v":99},{"$f":"'Qualifying Round 1'!#REF!","v":{"$error":"#REF!"}},{"$f":"IFERROR(VLOOKUP(D7,public_rn_racers[[Race '#]:[Name]],2,FALSE),\"\")","v":""},{"$f":"IFERROR(VLOOKUP(D7,Q2_Times[],2,FALSE),99)","v":99}]
[{"$f":"'Qualifying Round 1'!#REF!","v":{"$error":"#REF!"}},{"$f":"IFERROR(VLOOKUP(A8,public_rn_racers[[Race '#]:[Name]],2,FALSE),\"\")","v":""},{"$f":"IFERROR(VLOOKUP(A8,Q2_Times[],2,FALSE),99)","v":99},{"$f":"'Qualifying Round 1'!#REF!","v":{"$error":"#REF!"}},{"$f":"IFERROR(VLOOKUP(D8,public_rn_racers[[Race '#]:[Name]],2,FALSE),\"\")","v":""},{"$f":"IFERROR(VLOOKUP(D8,Q2_Times[],2,FALSE),99)","v":99}]
[{"$f":"'Qualifying Round 1'!A9","v":4250},{"$f":"IFERROR(VLOOKUP(A9,public_rn_racers[[Race '#]:[Name]],2,FALSE),\"\")","v":"Steve Ashdown"},{"$f":"IFERROR(VLOOKUP(A9,Q2_Times[],2,FALSE),99)","v":99},{"$f":"'Qualifying Round 1'!#REF!","v":{"$error":"#REF!"}},{"$f":"IFERROR(VLOOKUP(D9,public_rn_racers[[Race '#]:[Name]],2,FALSE),\"\")","v":""},{"$f":"IFERROR(VLOOKUP(D9,Q2_Times[],2,FALSE),99)","v":99}]
[{"$f":"'Qualifying Round 1'!#REF!","v":{"$error":"#REF!"}},{"$f":"IFERROR(VLOOKUP(A10,public_rn_racers[[Race '#]:[Name]],2,FALSE),\"\")","v":""},{"$f":"IFERROR(VLOOKUP(A10,Q2_Times[],2,FALSE),99)","v":99},{"$f":"'Qualifying Round 1'!#REF!","v":{"$error":"#REF!"}},{"$f":"IFERROR(VLOOKUP(D10,public_rn_racers[[Race '#]:[Name]],2,FALSE),\"\")","v":""},{"$f":"IFERROR(VLOOKUP(D10,Q2_Times[],2,FALSE),99)","v":99}]

{"sheet":"Q1-4 Results","index":6,"n_rows":7,"n_cols":6,"rows_kept":7,"cut":false,"hidden":false,"merged":[[0,0,0,5],[2,0,2,1],[2,3,2,4]]}
["Overall Qualifying After Round 4"]
[]
["Left",null,null,"Right"]
["Race #","Name","Time","Race #","Name","Time"]
[{"$f":"'Qualifying Round 3'!A8","v":{"$error":"#REF!"}},{"$f":"IFERROR(VLOOKUP(A5,public_rn_racers[[Race '#]:[Name]],2,FALSE),\"\")","v":""},{"$f":"IFERROR(VLOOKUP(A5,#REF!,2,FALSE),99)","v":99},{"$f":"'Qualifying Round 3'!C8","v":{"$error":"#REF!"}},{"$f":"IFERROR(VLOOKUP(D5,public_rn_racers[[Race '#]:[Name]],2,FALSE),\"\")","v":""},{"$f":"IFERROR(VLOOKUP(D5,#REF!,2,FALSE),99)","v":99}]
[{"$f":"'Qualifying Round 3'!A10","v":{"$error":"#REF!"}},{"$f":"IFERROR(VLOOKUP(A6,public_rn_racers[[Race '#]:[Name]],2,FALSE),\"\")","v":""},{"$f":"IFERROR(VLOOKUP(A6,#REF!,2,FALSE),99)","v":99},{"$f":"'Qualifying Round 3'!C9","v":{"$error":"#REF!"}},{"$f":"IFERROR(VLOOKUP(D6,public_rn_racers[[Race '#]:[Name]],2,FALSE),\"\")","v":""},{"$f":"IFERROR(VLOOKUP(D6,#REF!,2,FALSE),99)","v":99}]
[{"$f":"'Qualifying Round 3'!A9","v":{"$error":"#REF!"}},{"$f":"IFERROR(VLOOKUP(A7,public_rn_racers[[Race '#]:[Name]],2,FALSE),\"\")","v":""},{"$f":"IFERROR(VLOOKUP(A7,#REF!,2,FALSE),99)","v":99},{"$f":"'Qualifying Round 3'!C10","v":{"$error":"#REF!"}},{"$f":"IFERROR(VLOOKUP(D7,public_rn_racers[[Race '#]:[Name]],2,FALSE),\"\")","v":""},{"$f":"IFERROR(VLOOKUP(D7,#REF!,2,FALSE),99)","v":99}]

{"sheet":"Q1 Times","index":7,"n_rows":11,"n_cols":2,"rows_kept":11,"cut":false,"hidden":false,"merged":[]}
["Race #","time"]
["832",6.0971000000000002]
["12",6.1710000000000003]
["1953",6.4276999999999997]
["777",7.2222]
["101",10.136100000000001]
["2",10.373100000000001]
["2208",10.990600000000001]
["3630",11.307600000000001]
["67",18.476199999999999]
["570",22.5366]

{"sheet":"Q2 Times","index":8,"n_rows":8,"n_cols":2,"rows_kept":8,"cut":false,"hidden":false,"merged":[]}
["Race #","time"]
["832",6.0659000000000001]
["2",6.1681999999999997]
["570",6.2695999999999996]
["1953",6.4269999999999996]
["12",6.5141]
["101",7.3402000000000003]
["625",8.9821000000000009]

{"sheet":"Q1-3 Times","index":9,"n_rows":1,"n_cols":2,"rows_kept":1,"cut":false,"hidden":false,"merged":[]}
["Race #","time"]